{"text_format":"1","workbook":"xlsx","n_sheets":9,"sheets":["WI","Summary","Overview Dealers","Questions - Dealer&Distributor","Overview","Questions - Manufacturing","Riepilogo Dealer","Riepilogo","Info and attachments (pdf)"],"not_rendered":{"charts":5,"images":9,"macros":1,"external_links":0,"defined_names":54,"comments":0,"pivot_tables":2},"unopened":[],"bounds":{"document_bytes":16777216,"sheet_cells":100000,"rows_first":2000,"rows_last":500,"rows_between":2000,"halvings":0,"cell_chars":16384,"cell_head_chars":4096},"cells_cut":0,"cells_raw":0,"read":"whole","date_system":"1900"}

{"sheet":"WI","index":0,"n_rows":96,"n_cols":14,"rows_kept":96,"cut":false,"hidden":false,"merged":[[50,9,74,9],[75,9,99,9],[0,12,0,14],[1,13,1,14],[2,9,2,14],[8,9,12,9],[13,9,35,9],[36,9,49,9]]}
["         ",null,null,null,null,null,null,null,null,null,null,null,"Mod PG 06.02-06"]
["         ",null,null,null,null,null,null,null,null,null,null,null,null,"Rev. 02"]
[null,null,null,null,null,null,null,null,null,"Supplier Onboarding Form"]
["This audit form is meant to have a first self-assesment on supplier's quality system management according to ISO 9001:2015 and to fulfill the Quality part of the onboarding provcedure SP06-01."]
["Please, in order to avoid code errors, download the file and save it on your computer/in a folder."]
["Once you open it, enable macros."]
[]
["Picture",null,null,null,null,null,null,null,null,"Owner","Instruction"]
[null,null,null,null,null,null,null,null,null,"Modine SQA","At the moment of the onboarding or for a 2nd party periodic audit,"]
[null,null,null,null,null,null,null,null,null,null,"Modine SQA picks up the audit form from the Sharepoint and "]
{"$rows_left_out":87}
{"sheet":"Summary","index":1,"n_rows":46,"n_cols":12,"rows_kept":46,"cut":false,"hidden":false,"merged":[[4,2,4,5],[5,8,5,10],[11,8,11,10],[14,6,14,7],[12,6,12,7],[14,2,14,5],[11,6,11,7],[11,2,11,5],[12,8,12,10],[13,8,13,10],[13,6,13,7],[11,0,11,1],[17,2,18,5],[6,0,6,1],[6,2,6,5],[5,2,5,5],[15,0,15,1],[0,8,0,10],[2,5,2,10],[20,2,20,4],[20,7,20,10],[1,9,1,10],[9,0,9,10],[10,0,10,1],[10,6,10,7],[10,8,10,10],[10,2,10,5],[7,9,7,10],[7,7,7,8],[4,7,4,10],[3,8,3,10],[5,0,5,1],[4,0,4,1],[20,0,20,1],[21,7,21,10],[21,0,21,1],[21,2,21,4],[13,2,13,5],[13,0,13,1],[15,6,15,7],[15,8,15,10],[15,2,15,5],[17,0,17,1],[14,0,14,1],[17,6,17,7],[17,8,18,10],[24,0,32,10],[3,0,3,1],[14,8,14,10],[43,3,43,5],[44,3,44,5],[42,3,42,5],[40,4,40,5],[34,0,34,5],[38,4,38,5],[39,4,39,5],[36,3,37,5],[33,0,33,10],[36,6,36,7],[19,0,19,10],[12,2,12,5],[23,0,23,10]]}
["         ",null,null,null,null,null,null,null,"Mod PG 06.02-06"]
["         ",null,null,null,null,null,null,null,null,"Rev. 02"]
[null,null,null,null,null,"Supplier Onboarding Form"]
["Supplier category",null,1,null,null,null,{"$f":"VLOOKUP(C4,Riepilogo!$S$5:$T$7,2,FALSE)","v":"Choose Supplier Type"},null,"According to ISO 9001:2015 "]
["Region",null,null,null,null,null,null,{"$f":"concatenastringhe(G4)","v":""}]
["Business Unit",null,null,null,null,null,{"$f":"VLOOKUP(C7,Riepilogo!$S$11:$T$16,2,FALSE)","v":{"$error":"#N/A"}},"Date"]
["Modine's Plant"]
[]
[]
["Supplier Details"]
{"$rows_left_out":37}
{"sheet":"Overview Dealers","index":2,"n_rows":37,"n_cols":17,"rows_kept":37,"cut":false,"hidden":true,"merged":[[30,13,30,14],[31,13,31,14],[1,12,2,12],[1,13,2,16],[3,13,3,16],[27,11,28,12],[27,13,27,15],[28,13,28,14],[29,13,29,14],[34,7,34,8],[35,7,35,8],[36,7,36,8],[28,1,31,1],[1,2,2,2],[1,3,2,9],[3,3,3,9]]}
[null,null,null,null,null,null,null,{"$f":"Summary!I1","v":"Mod PG 06.02-06"},{"$f":"Summary!J2","v":"Rev. 02"},null,null,null,null,null,null,{"$f":"Summary!I1","v":"Mod PG 06.02-06"},{"$f":"Summary!J2","v":"Rev. 02"}]
[null,null,"Dealer&Distributor ",null,null,null,null,null,null,null,null,null,"Dealer&Distributor ",{"$f":"IF(Summary!C11=0,\"\",Summary!C11)","v":""}]
[]
[null,null,"Date",{"$f":"IF(Summary!I6=0,\"\",Summary!I6)","v":""},null,null,null,null,null,null,null,null,"Date",{"$f":"IF(Summary!I6=0,\"\",Summary!I6)","v":""}]
[]
[]
["Nr.","ISO 9001:2015","Element / Topic"]
[null,null,"Quality management system","Supplier Self-assessment",null,"Modine assessment",null,"Findings","Remarks"]
[{"$f":"'Questions - Manufacturing'!$A$13","v":1},{"$f":"'Questions - Manufacturing'!$B$13","v":"8.4.1"},{"$f":"'Questions - Manufacturing'!$C$13","v":"Certification status "},{"$f":"'Riepilogo Dealer'!I2","v":"-"},{"$f":"'Riepilogo Dealer'!H2","v":""},{"$f":"'Riepilogo Dealer'!L2","v":"-"},{"$f":"'Riepilogo Dealer'!K2","v":""},{"$f":"IF('Riepilogo Dealer'!M2=0,\"\",'Riepilogo Dealer'!M2)","v":""},{"$f":"IF('Riepilogo Dealer'!N2=0,\"\",'Riepilogo Dealer'!N2)","v":""}]
[{"$f":"'Questions - Manufacturing'!$A$18","v":2},{"$f":"'Questions - Dealer&Distributor'!$B$18","v":"5.3 & 6.2"},{"$f":"'Questions - Manufacturing'!$C$18","v":"organizational Roles, responsibilities and Authorities, Quality Objectives and planning to achieve them"},{"$f":"'Riepilogo Dealer'!I3","v":"-"},{"$f":"'Riepilogo Dealer'!H3","v":""},{"$f":"'Riepilogo Dealer'!L3","v":"-"},{"$f":"'Riepilogo Dealer'!K3","v":""},{"$f":"IF('Riepilogo Dealer'!M3=0,\"\",'Riepilogo Dealer'!M3)","v":""},{"$f":"IF('Riepilogo Dealer'!N3=0,\"\",'Riepilogo Dealer'!N3)","v":""}]
{"$rows_left_out":28}
{"sheet":"Questions - Dealer&Distributor","index":3,"n_rows":105,"n_cols":11,"rows_kept":105,"cut":false,"hidden":true,"merged":[[65,9,68,9],[60,9,63,9],[54,9,57,9],[49,9,52,9],[44,9,47,9],[101,9,104,9],[96,9,99,9],[91,9,94,9],[86,9,89,9],[80,9,83,9],[1,3,2,3],[1,4,2,10],[59,0,63,0],[59,1,63,1],[59,2,63,2],[60,10,63,10],[48,0,52,0],[48,1,52,1],[48,2,52,2],[49,10,52,10],[53,0,57,0],[53,1,57,1],[53,2,57,2],[54,10,57,10],[43,0,47,0],[43,1,47,1],[64,0,68,0],[64,1,68,1],[64,2,68,2],[65,10,68,10],[100,0,104,0],[100,2,104,2],[101,10,104,10],[85,1,104,1],[85,0,89,0],[85,2,89,2],[86,10,89,10],[90,0,94,0],[90,2,94,2],[91,10,94,10],[95,0,99,0],[95,2,99,2],[96,10,99,10],[79,0,83,0],[79,1,83,1],[79,2,83,2],[80,10,83,10],[69,0,73,0],[69,1,73,1],[69,2,73,2],[70,10,73,10],[74,0,78,0],[74,1,78,1],[74,2,78,2],[75,10,78,10],[75,9,78,9],[70,9,73,9],[43,2,47,2],[44,10,47,10],[38,0,42,0],[38,1,42,1],[38,2,42,2],[39,10,42,10],[39,9,42,9],[22,0,26,0],[22,1,26,1],[22,2,26,2],[23,10,26,10],[33,0,37,0],[33,1,37,1],[33,2,37,2],[34,10,37,10],[27,0,31,0],[27,1,31,1],[27,2,31,2],[28,10,31,10],[34,9,37,9],[28,9,31,9],[23,9,26,9],[17,0,21,0],[17,1,21,1],[17,2,21,2],[18,10,21,10],[18,9,21,9],[6,0,9,10],[12,0,16,0],[12,1,16,1],[12,2,16,2],[13,10,16,10],[13,9,16,9]]}
[]
[null,null,null,"Dealer&Distributor ",{"$f":"IF(Summary!C11=0,\"\",Summary!C11)","v":""}]
[]
[]
[null,null,null,"Date",null,null,null,null,null,null,{"$f":"IF(Summary!I6=0,\"\",Summary!I6)","v":""}]
[]
["WARNING: In case the Supplier is one in the dedicated Vendor List of Customers that require additional requirements to the ISO 9001 standard and or requires that the tier two supplier are deployed of such requirements,, the list of the additional requirements has to be attached to this check list (info and attachments - pdf) and all the questions has to be interpreted and evaluated taking in consideration all the additional requirements. The outcome of the Audit shall clearly identify the correspondence to those additional  requirement"]
[]
[]
[]
{"$rows_left_out":96}
{"sheet":"Overview","index":4,"n_rows":62,"n_cols":17,"rows_kept":62,"cut":false,"hidden":true,"merged":[[31,13,31,14],[32,13,32,14],[33,13,33,14],[1,13,2,16],[1,2,2,2],[1,12,2,12],[3,5,3,8],[29,11,30,12],[29,13,29,15],[30,13,30,14],[60,7,60,8],[61,7,61,8],[59,7,59,8],[1,3,2,9],[49,1,53,1]]}
[null,null,null,null,null,null,null,{"$f":"Summary!I1","v":"Mod PG 06.02-06"},{"$f":"Summary!J2","v":"Rev. 02"},null,null,null,null,null,null,{"$f":"Summary!I1","v":"Mod PG 06.02-06"},{"$f":"Summary!J2","v":"Rev. 02"}]
[null,null,"Manufacturing ",null,null,null,null,null,null,null,null,null,"Manufacturing",{"$f":"IF(Summary!C11=0,\"\",Summary!C11)","v":""}]
[]
[null,null,null,"Date",null,{"$f":"IF(Summary!I6=0,\"\",Summary!I6)","v":""},null,null,null,null,null,null,null,null,"Date",{"$f":"IF(Summary!I6=0,\"\",Summary!I6)","v":""}]
[]
[]
["Nr.","ISO 9001:2015","Element / Topic"]
[null,null,"Quality management system","Supplier Self-assessment",null,"Modine assessment",null,"Findings","Remarks"]
[{"$f":"'Questions - Manufacturing'!$A$13","v":1},{"$f":"'Questions - Manufacturing'!$B$13","v":"8.4.1"},{"$f":"'Questions - Manufacturing'!$C$13","v":"Certification status "},{"$f":"Riepilogo!I2","v":"-"},{"$f":"Riepilogo!H2","v":""},{"$f":"Riepilogo!L2","v":"-"},{"$f":"Riepilogo!K2","v":""},{"$f":"IF(Riepilogo!M2=0,\"\",Riepilogo!M2)","v":""},{"$f":"IF(Riepilogo!N2=0,\"\",Riepilogo!N2)","v":""}]
[{"$f":"'Questions - Manufacturing'!$A$18","v":2},{"$f":"'Questions - Manufacturing'!$B$18","v":"5.3 & 6.2"},{"$f":"'Questions - Manufacturing'!$C$18","v":"organizational Roles, responsibilities and Authorities, Quality Objectives and planning to achieve them"},{"$f":"Riepilogo!I3","v":"-"},{"$f":"Riepilogo!H3","v":""},{"$f":"Riepilogo!L3","v":"-"},{"$f":"Riepilogo!K3","v":""},{"$f":"IF(Riepilogo!M3=0,\"\",Riepilogo!M3)","v":""},{"$f":"IF(Riepilogo!N3=0,\"\",Riepilogo!N3)","v":""}]
{"$rows_left_out":53}
{"sheet":"Questions - Manufacturing","index":5,"n_rows":221,"n_cols":11,"rows_kept":221,"cut":false,"hidden":true,"merged":[[160,9,163,9],[165,9,168,9],[217,9,220,9],[170,9,173,9],[175,9,178,9],[180,9,183,9],[185,9,188,9],[191,9,194,9],[196,9,199,9],[201,9,204,9],[206,9,209,9],[211,9,214,9],[159,2,163,2],[43,9,46,9],[49,9,52,9],[54,9,57,9],[59,9,62,9],[64,9,67,9],[69,9,72,9],[74,9,77,9],[79,9,82,9],[84,9,87,9],[89,9,92,9],[94,9,97,9],[99,9,102,9],[105,9,108,9],[110,9,113,9],[115,9,118,9],[120,9,123,9],[125,9,128,9],[130,9,133,9],[135,9,138,9],[140,9,143,9],[145,9,148,9],[150,9,153,9],[155,9,158,9],[48,2,52,2],[69,10,72,10],[73,2,77,2],[63,2,67,2],[28,10,31,10],[33,10,36,10],[38,10,41,10],[169,2,173,2],[155,10,158,10],[164,2,168,2],[83,2,87,2],[124,2,128,2],[129,2,133,2],[68,2,72,2],[54,10,57,10],[59,10,62,10],[43,10,46,10],[49,10,52,10],[84,10,87,10],[99,10,102,10],[105,10,108,10],[74,10,77,10],[79,10,82,10],[110,10,113,10],[170,10,173,10],[13,10,16,10],[135,10,138,10],[140,10,143,10],[18,10,21,10],[23,10,26,10],[160,10,163,10],[145,10,148,10],[150,10,153,10],[89,10,92,10],[94,10,97,10],[125,10,128,10],[130,10,133,10],[115,10,118,10],[48,1,52,1],[53,2,57,2],[58,2,62,2],[42,2,46,2],[64,10,67,10],[2,3,4,3],[2,4,4,10],[12,2,16,2],[17,2,21,2],[22,2,26,2],[27,2,31,2],[32,2,36,2],[37,2,41,2],[12,1,16,1],[13,9,16,9],[18,9,21,9],[23,9,26,9],[28,9,31,9],[33,9,36,9],[38,9,41,9],[6,0,9,10],[17,0,21,0],[17,1,21,1],[22,0,26,0],[22,1,26,1],[32,0,36,0],[27,0,31,0],[12,0,16,0],[37,0,41,0],[37,1,41,1],[32,1,36,1],[27,1,31,1],[217,10,220,10],[206,10,209,10],[184,1,188,1],[184,2,188,2],[211,10,214,10],[210,0,214,0],[210,2,214,2],[190,1,214,1],[216,0,220,0],[216,1,220,1],[216,2,220,2],[200,0,204,0],[200,2,204,2],[205,0,209,0],[205,2,209,2],[190,0,194,0],[190,2,194,2],[195,0,199,0],[195,2,199,2],[185,10,188,10],[191,10,194,10],[201,10,204,10],[196,10,199,10],[184,0,188,0],[174,2,178,2],[179,2,183,2],[175,10,178,10],[180,10,183,10],[78,0,82,0],[78,1,82,1],[88,0,92,0],[88,1,92,1],[88,2,92,2],[78,2,82,2],[139,2,143,2],[134,2,138,2],[104,0,108,0],[93,0,97,0],[93,1,97,1],[93,2,97,2],[98,2,102,2],[119,0,123,0],[119,1,123,1],[114,2,118,2],[104,1,108,1],[119,2,123,2],[114,0,118,0],[134,0,138,0],[114,1,118,1],[104,2,108,2],[154,2,158,2],[42,0,46,0],[42,1,46,1],[179,0,183,0],[179,1,183,1],[164,0,168,0],[164,1,168,1],[159,0,163,0],[159,1,163,1],[53,1,57,1],[53,0,57,0],[83,0,87,0],[83,1,87,1],[68,0,72,0],[124,1,128,1],[48,0,52,0],[134,1,138,1],[129,0,133,0],[129,1,133,1],[124,0,128,0],[58,0,62,0],[58,1,62,1],[68,1,72,1],[63,0,67,0],[63,1,67,1],[73,0,77,0],[98,0,102,0],[98,1,102,1],[120,10,123,10],[73,1,77,1],[165,10,168,10],[169,1,173,1],[174,0,178,0],[174,1,178,1],[154,0,158,0],[154,1,158,1],[109,0,113,0],[109,1,113,1],[109,2,113,2],[169,0,173,0],[144,0,148,0],[144,1,148,1],[149,0,153,0],[149,1,153,1],[144,2,148,2],[149,2,153,2],[139,0,143,0],[139,1,143,1]]}
[]
[]
[null,null,null,"Manufacturing ",{"$f":"IF(Summary!C11=0,\"\",Summary!C11)","v":""}]
[]
[]
[null,null,null,"Date",null,null,null,null,null,null,{"$f":"IF(Summary!I6=0,\"\",Summary!I6)","v":""}]
["WARNING: In case the Supplier is one in the dedicated Vendor List of Customers that require additional requirements to the ISO 9001 standard and or requires that the tier two supplier are deployed of such requirements,, the list of the additional requirements has to be attached to this check list (info and attachments - pdf) and all the questions has to be interpreted and evaluated taking in consideration all the additional requirements. The outcome of the Audit shall clearly identify the correspondence to those additional  requirement"]
[]
[]
[]
{"$rows_left_out":212}
{"sheet":"Riepilogo Dealer","index":6,"n_rows":20,"n_cols":25,"rows_kept":20,"cut":false,"hidden":true,"merged":[]}
["Group","ID","Min group ID","Max group ID","Label","Topic","Score","Self-assessment","% self","Score","Actual","% Actual","Findings","Remarks",null,null,null,null,null,null,"Choose Audit step",null,"Row Labels","Supplier Self-assessment ","Modine assessment"]
["Quality management system",{"$f":"'Questions - Dealer&Distributor'!$A$13","v":1},{"$f":"_xlfn.MINIFS(B:B,A:A,\"=\"&A2)","v":1},{"$f":"_xlfn.MAXIFS(B:B,A:A,\"=\"&A2)","v":4},{"$f":"IF(C2=D2,CONCATENATE(A2,\" \",\"(\",C2,\")\"),CONCATENATE(A2,\" \",\"(\",C2,\"-\",D2,\")\"))","v":"Quality management system (1-4)"},{"$f":"'Questions - Dealer&Distributor'!$C$13","v":"Certification status "},{"$f":"'Questions - Dealer&Distributor'!$G$13","v":""},{"$f":"IF(G2=\"N/A\",-1,G2)","v":""},{"$f":"IF(H2=-1,\"-\",IF(COUNT(H2)>=1,H2/3,\"-\"))","v":"-"},{"$f":"'Questions - Dealer&Distributor'!$I$13","v":""},{"$f":"IF(J2=\"N/A\",-1,J2)","v":""},{"$f":"IF(K2=-1,\"-\",IF(COUNT(K2)>=1,K2/3,\"-\"))","v":"-"},{"$f":"'Questions - Dealer&Distributor'!J14","v":0},{"$f":"'Questions - Dealer&Distributor'!K14","v":0},null,null,null,null,null,null,"Self-assessment",null,1,0,0]
["Quality management system",{"$f":"'Questions - Dealer&Distributor'!$A$18","v":2},1,4,{"$f":"IF(C3=D3,CONCATENATE(A3,\" \",\"(\",C3,\")\"),CONCATENATE(A3,\" \",\"(\",C3,\"-\",D3,\")\"))","v":"Quality management system (1-4)"},{"$f":"'Questions - Dealer&Distributor'!$C$18","v":"Organizational Roles, responsibilities and Authorities, Quality Objectives and planning to achieve them"},{"$f":"'Questions - Dealer&Distributor'!$G$18","v":""},{"$f":"IF(G3=\"N/A\",-1,G3)","v":""},{"$f":"IF(H3=-1,\"-\",IF(COUNT(H3)>=1,H3/3,\"-\"))","v":"-"},{"$f":"'Questions - Dealer&Distributor'!$I$18","v":""},"",{"$f":"IF(K3=-1,\"-\",IF(COUNT(K3)>=1,K3/3,\"-\"))","v":"-"},{"$f":"'Questions - Dealer&Distributor'!J19","v":0},{"$f":"'Questions - Dealer&Distributor'!K19","v":0},null,null,null,null,null,null,"Audit",null,2,0,0]
["Quality management system",{"$f":"'Questions - Dealer&Distributor'!$A$23","v":3},1,4,"Quality management system (1-4)",{"$f":"'Questions - Dealer&Distributor'!$C$23","v":"Control of documented information"},{"$f":"'Questions - Dealer&Distributor'!$G$23","v":""},"","-",{"$f":"'Questions - Dealer&Distributor'!$I$23","v":""},"","-",{"$f":"'Questions - Dealer&Distributor'!J24","v":0},{"$f":"'Questions - Dealer&Distributor'!K24","v":0},null,null,null,null,null,null,null,null,3,0,0]
["Quality management system",{"$f":"'Questions - Dealer&Distributor'!$A$28","v":4},1,4,"Quality management system (1-4)",{"$f":"'Questions - Dealer&Distributor'!$C$28","v":"Design and Development controls"},{"$f":"'Questions - Dealer&Distributor'!$G$28","v":""},"","-",{"$f":"'Questions - Dealer&Distributor'!$I$28","v":""},"","-",{"$f":"'Questions - Dealer&Distributor'!J29","v":0},{"$f":"'Questions - Dealer&Distributor'!K29","v":0},null,null,null,null,null,null,null,null,4,0,0]
["Contract review process",{"$f":"'Questions - Dealer&Distributor'!$A$34","v":5},5,9,"Contract review process (5-9)",{"$f":"'Questions - Dealer&Distributor'!$C$34","v":"Requirements for Products & services"},{"$f":"'Questions - Dealer&Distributor'!$G$34","v":""},"","-",{"$f":"'Questions - Dealer&Distributor'!$I$34","v":""},"","-",{"$f":"'Questions - Dealer&Distributor'!J35","v":0},{"$f":"'Questions - Dealer&Distributor'!K35","v":0},null,null,null,null,null,null,null,null,5,0,0]
["Contract review process",{"$f":"'Questions - Dealer&Distributor'!$A$39","v":6},5,9,"Contract review process (5-9)",{"$f":"'Questions - Dealer&Distributor'!$C$39","v":"Design and development controls"},{"$f":"'Questions - Dealer&Distributor'!$G$39","v":""},"","-",{"$f":"'Questions - Dealer&Distributor'!$I$39","v":""},"","-",{"$f":"'Questions - Dealer&Distributor'!J40","v":0},{"$f":"'Questions - Dealer&Distributor'!K40","v":0},null,null,null,null,null,null,null,null,6,0,0]
["Contract review process",{"$f":"'Questions - Dealer&Distributor'!$A$44","v":7},5,9,"Contract review process (5-9)",{"$f":"'Questions - Dealer&Distributor'!$C$44","v":"Preservation"},{"$f":"'Questions - Dealer&Distributor'!$G$44","v":""},"","-",{"$f":"'Questions - Dealer&Distributor'!$I$44","v":""},"","-",{"$f":"'Questions - Dealer&Distributor'!J45","v":0},{"$f":"'Questions - Dealer&Distributor'!K45","v":0},null,null,null,null,null,null,null,null,7,0,0]
["Contract review process",{"$f":"'Questions - Dealer&Distributor'!$A$49","v":8},5,9,"Contract review process (5-9)",{"$f":"'Questions - Dealer&Distributor'!$C$49","v":"Release of Products & services"},{"$f":"'Questions - Dealer&Distributor'!$G$49","v":""},"","-",{"$f":"'Questions - Dealer&Distributor'!$I$49","v":""},"","-",{"$f":"'Questions - Dealer&Distributor'!J50","v":0},{"$f":"'Questions - Dealer&Distributor'!K50","v":0},null,null,null,null,null,null,null,null,8,0,0]
["Contract review process",{"$f":"'Questions - Dealer&Distributor'!$A$54","v":9},5,9,"Contract review process (5-9)",{"$f":"'Questions - Dealer&Distributor'!$C$54","v":"Release of Products & services"},{"$f":"'Questions - Dealer&Distributor'!$G$54","v":""},"","-",{"$f":"'Questions - Dealer&Distributor'!$I$54","v":""},"","-",{"$f":"'Questions - Dealer&Distributor'!J55","v":0},{"$f":"'Questions - Dealer&Distributor'!K55","v":0},null,null,null,null,null,null,null,null,9,0,0]
{"$rows_left_out":11}
{"sheet":"Riepilogo","index":7,"n_rows":43,"n_cols":24,"rows_kept":43,"cut":false,"hidden":true,"merged":[]}
["Group","ID","Min group ID","Max group ID","Label","Topic","Score","Self-assessment","% self","Score","Mod assessment","% Actual","Findings","Remarks",null,null,null,null,1,"Choose Audit step",null,"Row Labels","Supplier self-assessment","Modine assessment"]
["Quality management system",{"$f":"'Questions - Manufacturing'!$A$13","v":1},{"$f":"_xlfn.MINIFS(B:B,A:A,\"=\"&A2)","v":1},{"$f":"_xlfn.MAXIFS(B:B,A:A,\"=\"&A2)","v":7},{"$f":"IF(C2=D2,CONCATENATE(A2,\" \",\"(\",C2,\")\"),CONCATENATE(A2,\" \",\"(\",C2,\"-\",D2,\")\"))","v":"Quality management system (1-7)"},{"$f":"'Questions - Manufacturing'!$C$13","v":"Certification status "},{"$f":"'Questions - Manufacturing'!$G$13","v":""},{"$f":"IF(G2=\"N/A\",-1,G2)","v":""},{"$f":"IF(H2=-1,\"-\",IF(COUNT(H2)>=1,H2/3,\"-\"))","v":"-"},{"$f":"'Questions - Manufacturing'!$I$13","v":""},{"$f":"IF(J2=\"N/A\",-1,J2)","v":""},{"$f":"IF(K2=-1,\"-\",IF(COUNT(K2)>=1,K2/3,\"-\"))","v":"-"},{"$f":"'Questions - Manufacturing'!J14","v":0},{"$f":"'Questions - Manufacturing'!K14","v":0},null,null,null,null,2,"Supplier self-assessment",null,1,0,0]
["Quality management system",{"$f":"'Questions - Manufacturing'!$A$18","v":2},1,7,{"$f":"IF(C3=D3,CONCATENATE(A3,\" \",\"(\",C3,\")\"),CONCATENATE(A3,\" \",\"(\",C3,\"-\",D3,\")\"))","v":"Quality management system (1-7)"},{"$f":"'Questions - Manufacturing'!$C$18","v":"organizational Roles, responsibilities and Authorities, Quality Objectives and planning to achieve them"},{"$f":"'Questions - Manufacturing'!$G$18","v":""},{"$f":"IF(G3=\"N/A\",-1,G3)","v":""},{"$f":"IF(H3=-1,\"-\",IF(COUNT(H3)>=1,H3/3,\"-\"))","v":"-"},{"$f":"'Questions - Manufacturing'!$I$18","v":""},{"$f":"IF(J3=\"N/A\",-1,J3)","v":""},{"$f":"IF(K3=-1,\"-\",IF(COUNT(K3)>=1,K3/3,\"-\"))","v":"-"},{"$f":"'Questions - Manufacturing'!J19","v":0},{"$f":"'Questions - Manufacturing'!K19","v":0},null,null,null,null,3,"Modine assessment",null,2,0,0]
["Quality management system",{"$f":"'Questions - Manufacturing'!$A$23","v":3},1,7,"Quality management system (1-7)",{"$f":"'Questions - Manufacturing'!$C$23","v":"Control of documented information"},{"$f":"'Questions - Manufacturing'!$G$23","v":""},"","-",{"$f":"'Questions - Manufacturing'!$I$23","v":""},{"$f":"IF(J4=\"N/A\",-1,J4)","v":""},"-",{"$f":"'Questions - Manufacturing'!J24","v":0},{"$f":"'Questions - Manufacturing'!K24","v":0},null,null,null,null,null,null,null,3,0,0]
["Quality management system",{"$f":"'Questions - Manufacturing'!$A$28","v":4},1,7,"Quality management system (1-7)",{"$f":"'Questions - Manufacturing'!$C$28","v":"Design and development changes"},{"$f":"'Questions - Manufacturing'!$G$28","v":""},"","-",{"$f":"'Questions - Manufacturing'!$I$28","v":""},"","-",{"$f":"'Questions - Manufacturing'!J29","v":0},{"$f":"'Questions - Manufacturing'!K29","v":0},null,null,null,null,1,"Choose Supplier Type",null,4,0,0]
["Quality management system",{"$f":"'Questions - Manufacturing'!$A$33","v":5},1,7,"Quality management system (1-7)",{"$f":"'Questions - Manufacturing'!$C$33","v":"Design and Development controls"},{"$f":"'Questions - Manufacturing'!$G$33","v":""},"","-",{"$f":"'Questions - Manufacturing'!$I$33","v":""},"","-",{"$f":"'Questions - Manufacturing'!J34","v":0},{"$f":"'Questions - Manufacturing'!K34","v":0},null,null,null,null,2,"Manufacturing",null,5,0,0]
["Quality management system",{"$f":"'Questions - Manufacturing'!$A$38","v":6},1,7,"Quality management system (1-7)",{"$f":"'Questions - Manufacturing'!$C$38","v":"Internal audit"},{"$f":"'Questions - Manufacturing'!$G$38","v":""},"","-",{"$f":"'Questions - Manufacturing'!$I$38","v":""},"","-",{"$f":"'Questions - Manufacturing'!J39","v":0},{"$f":"'Questions - Manufacturing'!K39","v":0},null,null,null,null,3,"Dealer&Distributor",null,6,0,0]
["Quality management system",{"$f":"'Questions - Manufacturing'!$A$43","v":7},1,7,"Quality management system (1-7)",{"$f":"'Questions - Manufacturing'!$C$43","v":"Continual improvement"},{"$f":"'Questions - Manufacturing'!$G$43","v":""},"","-",{"$f":"'Questions - Manufacturing'!$I$43","v":""},"","-",{"$f":"'Questions - Manufacturing'!J44","v":0},{"$f":"'Questions - Manufacturing'!K44","v":0},null,null,null,null,null,null,null,7,0,0]
["Design & Development for product and process",{"$f":"'Questions - Manufacturing'!$A$49","v":8},8,18,"Design & Development for product and process (8-18)",{"$f":"'Questions - Manufacturing'!$C$49","v":"Requirements for Products & services"},{"$f":"'Questions - Manufacturing'!$G$49","v":""},"","-",{"$f":"'Questions - Manufacturing'!$I$49","v":""},"","-",{"$f":"'Questions - Manufacturing'!J50","v":0},{"$f":"'Questions - Manufacturing'!K50","v":0},null,null,null,null,null,null,null,8,0,0]
["Design & Development for product and process",{"$f":"'Questions - Manufacturing'!$A$54","v":9},8,18,"Design & Development for product and process (8-18)",{"$f":"'Questions - Manufacturing'!$C$54","v":"Design & Development planning"},{"$f":"'Questions - Manufacturing'!$G$54","v":""},"","-",{"$f":"'Questions - Manufacturing'!$I$54","v":""},"","-",{"$f":"'Questions - Manufacturing'!J55","v":0},{"$f":"'Questions - Manufacturing'!K55","v":0},null,null,null,null,1,"Plant",null,9,0,0]
{"$rows_left_out":34}
{"sheet":"Info and attachments (pdf)","index":8,"n_rows":32,"n_cols":6,"rows_kept":32,"cut":false,"hidden":false,"merged":[]}
[]
[]
[]
[]
[]
[]
[]
[]
[]
[]
{"$rows_left_out":22}